Page MenuHomePhabricator
Paste Active Pastes
  • P1008 fpm.conf
    [global]
    error_log = /core/var/log/fpm.log
    [www]
    prefix = /core/var/pool/
    ...
    • Nov 27 2013, 8:40 PM
    • 19 Lines
  • >>> orbital ~/src/git $ ./bin-wrappers/git --version
    git version 1.7.0
    >>> orbital ~/src/git $ ./bin-wrappers/git ls-remote ssh://dweller@local.aphront.com/diffusion/P/
    b154b07f0e9e1cc886505f789fdf28b973f7880a HEAD
    b154b07f0e9e1cc886505f789fdf28b973f7880a refs/heads/master
    • Nov 27 2013, 8:13 PM
    • 5 Lines
  • Repository EA:
    Protocol: ssh
    Has User: Y
    Has Login: N
    Has Keyfile: Y
    ...
    • Nov 27 2013, 6:45 PM
    • 474 Lines
  • <?php
    require_once 'scripts/__init_script__.php';
    $table = new PhabricatorRepository();
    ...
    • Nov 27 2013, 6:42 PM
    • 26 Lines
  • Running storage upgrade
    Applying patch 'phabricator:20131120.nuancesourcetype.sql'...
    Applying patch 'phabricator:20131121.passphraseedge.sql'...
    Applying patch 'phabricator:20131121.repocredentials.1.col.sql'...
    Applying patch 'phabricator:20131121.repocredentials.2.mig.php'...
    ...
    • Nov 27 2013, 6:19 PM
    • 165 Lines
  • P1003 stubs.php
    <?php
    require_once 'scripts/__init_script__.php';
    $commit_table = new PhabricatorRepositoryCommit();
    ...
    • Nov 25 2013, 10:15 PM
    • 17 Lines
  • diff --git a/src/applications/repository/storage/PhabricatorRepository.php b/src/applications/repository/storage/PhabricatorRepository.php
    index 0591f29..8061043 100644
    --- a/src/applications/repository/storage/PhabricatorRepository.php
    +++ b/src/applications/repository/storage/PhabricatorRepository.php
    @@ -298,6 +298,7 @@ final class PhabricatorRepository extends PhabricatorRepositoryDAO
    ...
    • Nov 25 2013, 1:44 AM
    • 12 Lines
  • diff --git a/src/applications/repository/storage/PhabricatorRepository.php b/src/applications/repository/storage/PhabricatorRepository.php
    index 0591f29..8061043 100644
    --- a/src/applications/repository/storage/PhabricatorRepository.php
    +++ b/src/applications/repository/storage/PhabricatorRepository.php
    @@ -298,6 +298,7 @@ final class PhabricatorRepository extends PhabricatorRepositoryDAO
    ...
    • Nov 25 2013, 1:44 AM
    • 12 Lines
  • drydock
    - blueprints
    - resources
    - leases
    ...
    • Nov 23 2013, 4:26 AM
    • 29 Lines
  • Unexpected output:
    PhabricatorDataNotAttachedException: Attempting to access attached data on ManiphestTask (via getCustomFields()), but the data is not actually attached. Before accessing attachable data on an object, you must load and attach it.
    ...
    • Nov 22 2013, 12:13 AM
    • 36 Lines
  • {
    "project_id": "Tychaia",
    "conduit_uri": "http://code.redpointsoftware.com.au/",
    "arc.autostash": true,
    "load": [
    ...
    • Nov 21 2013, 9:54 PM
    • 26 Lines
  • Error updating working copy: Working copy at '/srv/git/phabricator_repositories/MYREPO/' has a mismatched origin URL. It has origin URL 'origin' (with remote path 'origin'), but the configured URL 'ssh://git@/myserver/myrepo.git' (with remote path '/myrepo.git') is expected. Refusing to proceed because this may indicate that the working copy is actually some other repository.
    • Nov 18 2013, 9:21 PM
    • 1 Line
  • ubuntu@ip-10-174-254-230:~/Tychaia$ arc unit --everything --trace
    libphutil loaded from '/home/ubuntu/libphutil/src'.
    arcanist loaded from '/home/ubuntu/arcanist/src'.
    Loading phutil library from '/home/ubuntu/Tychaia/Build/Arcanist'...
    >>> [0] <exec> $ git rev-parse --show-cdup
    ...
    • Nov 18 2013, 12:08 AM
    • 185 Lines
  • ==> phabricator-ssh-hook.sh <==
    #!/bin/sh
    ###
    ### WARNING: This feature is new and experimental. Use it at your own risk!
    ...
    • Nov 16 2013, 4:08 PM
    • 39 Lines
  • <?php
    if (!($conn = ldap_connect('127.0.0.1'))) {
    die("ldap_connect failed!\n");
    }
    ...
    • Nov 15 2013, 2:12 PM
    • 19 Lines
  • 2013-11-14 12:05:26-0800 [-] Calling getalldiffs with `revision_ids=[1051690]`
    2013-11-14 12:05:26-0800 [-] auth required
    2013-11-14 12:05:26-0800 [-] not authenticated
    2013-11-14 12:05:27-0800 [-] not authenticated
    2013-11-14 12:05:29-0800 [-] not authenticated
    • Nov 14 2013, 8:15 PM
    • 5 Lines
  • P989 derp.js
    onload();
    var onload = function() { /* ... */ };
    • Nov 13 2013, 9:47 PM
    • 2 Lines
  • arc lint
    Exception
    Some linters failed:
    - ArcanistPhpcsLinter: CommandException: Command failed with error #1!
    COMMAND
    ...
    • Nov 12 2013, 8:04 PM
    • 95 Lines
    • Plain Text
  • I found a bug, I modify the svn subpath from the parents path to child path, then the svn commits have not change.
    Fist, I load svn which path is http://172.16.0.75:8080/svn/Solution/branches/, there are 216 Subversion Commits on the web http://172.16.0.129/diffusion/, then my leader told me I should load the child path which is http://172.16.0.75:8080/svn/Solution/branches/20100825_HD2_V1R1_Satellite_For_120315, then I found on the web http://172.16.0.129/diffusion/, there are 216 svn commits too. But in fact, there are only 42 svn commits...,
    • Nov 11 2013, 2:02 AM
    • 3 Lines
  • ////////////////////////////////////////////////////////////////////////////////
    // In PHP, rendering the page:
    $node_id = celerity_generate_unique_node_id();
    ...
    • Nov 9 2013, 1:45 AM
    • 60 Lines
  • $result = $conn->query(
    'SELECT id, size, encoding '.
    'FROM harbormaster_buildlogchunk '.
    'WHERE logID = %d '.
    'ORDER BY id DESC '.
    ...
    • Nov 9 2013, 1:19 AM
    • 7 Lines
  • >>> orbital ~ $ echo '{}' | ssh localhost conduit conduit.ping
    Environment:
    USER=epriestley
    LOGNAME=epriestley
    HOME=/Users/epriestley
    ...
    • Nov 7 2013, 11:21 PM
    • 12 Lines
  • ip-10-42-2-180:/srv/sshd # ls -la
    total 16
    drwxr-xr-x 2 root root 4096 Nov 7 23:18 .
    drwxr-xr-x 6 root root 4096 Nov 7 22:21 ..
    -r-xr-xr-x 1 root root 160 Nov 7 22:45 phabricator-ssh-hook.sh
    ...
    • Nov 7 2013, 11:21 PM
    • 7 Lines
  • ip-10-42-2-180:~ # echo '{}' | ssh git@localhost conduit conduit.ping
    Environment:
    USER=git
    LOGNAME=git
    HOME=/srv/phabricator
    ...
    • Nov 7 2013, 11:20 PM
    • 11 Lines
  • ip-10-42-2-180:~ # /usr/sbin/sshd -f /srv/sshd/sshd_config -d -d -d
    debug2: load_server_config: filename /srv/sshd/sshd_config
    debug2: load_server_config: done config len = 300
    debug2: parse_server_config: config /srv/sshd/sshd_config len 300
    debug3: /srv/sshd/sshd_config:8 setting Port 22
    ...
    • Nov 7 2013, 11:19 PM
    • 345 Lines
  • ###
    ### WARNING: This feature is new and experimental. Use it at your own risk!
    ###
    # You must have OpenSSHD 6.2 or newer; support for AuthorizedKeysCommand was
    ...
    • Nov 7 2013, 11:16 PM
    • 24 Lines
  • #!/bin/sh
    ###
    ### WARNING: This feature is new and experimental. Use it at your own risk!
    ###
    ...
    • Nov 7 2013, 11:15 PM
    • 8 Lines
  • $ ./bin/mail show-outbound --id 11498
    PROPERTIES
    ID: 11498
    Status: sent
    Retry Count: 0
    ...
    • Nov 7 2013, 10:57 PM
    • 72 Lines
  • I have met this status for several times. I hope to solve it. Would you give me some advices, TKS..
    First, I install phabricator, and create serval repositories, everything is ok, but one or two months later I found that when I create a repository there are always have some problems, the daemon log show the error tips that I can't find xxx file like Error updating working copy: Command failed with error #1! COMMAND svn --non-interactive --no-auth-cache --trust-server-cert --username 'xxxxx' --password 'xxxxx' log --xml --quiet --limit 64 'http://172.16.0.75:8080/svn/Solution//branches/20100825_HD2_V1R1_Satellite_For_120315/'@'45' STDOUT <?xml version="1.0"?> <log> STDERR svn: 找不到路径 “/svn/Solution/!svn/bc/45/branches/20100825_HD2_V1R1_Satellite_For_120315”
    Yeah~~ my path is http://172.16.0.75:8080/svn/Solution//branches/20100825_HD2_V1R1_Satellite_For_120315...
    ...
    • Nov 7 2013, 2:32 AM
    • 14 Lines
  • [root@fennec breakpad]# hg push
    pushing to https://asherkin@bitbucket.org/asherkin/throttle
    searching for changes
    http authorization required
    realm: Bitbucket.org HTTP
    ...
    • Nov 7 2013, 1:42 AM
    • 11 Lines
  • $response = new \Symfony\Component\HttpFoundation\Response;
    $response->headers->set('Content-Type', 'application/mercurial-0.1');
    $oldLang = getenv('LANG');
    $oldLanguage = getenv('LANGUAGE');
    ...
    • Nov 6 2013, 10:18 PM
    • 133 Lines
    • PHP
  • private function getMercurialArguments() {
    // Mercurial sends arguments in HTTP headers. "Why?", you might wonder,
    // "Why would you do this?".
    $args_raw = array();
    ...
    • Nov 6 2013, 6:36 PM
    • 105 Lines
  • $nav->appendChild(
    array(
    $this->getSyncOverview(),
    $this->getLog("Pull Log", self::TFS_PULL_LOG),
    $this->getLog("Push Log", self::TFS_PUSH_LOG)
    ...
    • Nov 6 2013, 6:36 AM
    • 26 Lines
  • <?php
    final class ShellLogView extends AphrontView {
    private $lines;
    ...
    • Nov 6 2013, 6:34 AM
    • 94 Lines
  • # list of nodes encoding / decoding
    def decodelist(l, sep=' '):
    if l:
    return map(bin, l.split(sep))
    ...
    • Nov 5 2013, 3:43 AM
    • 30 Lines
  • james@james-laptop:~/git> ls
    2 4 ABC ASD created error hgtest new2 test tracking
    3 5 anothercreated content demo hgidx input newnew TEST
    james@james-laptop:~/git> ls created
    branches config description HEAD hooks info objects refs
    • Oct 31 2013, 9:22 PM
    • 5 Lines
  • Running 'PhabricatorRepositoryGitCommitMessageParserWorker'...
    Done.
    • Oct 30 2013, 11:32 PM
    • 3 Lines
  • 2013-10-29 22:12:15] EXCEPTION: (PhutilBootloaderException) Include of '/opt/libphutil/src/future/http/status/HTTPFutureResponseStatusCURL.php' failed! at [/opt/libphutil/src/__phutil_library_init__.php:197]
    PHP Fatal error: Uncaught exception 'PhutilBootloaderException' with message 'Include of '/opt/libphutil/src/readableserializer/PhutilReadableSerializer.php' failed!' in /opt/libphutil/src/__phutil_library_init__.php:197
    Stack trace:
    #0 /opt/libphutil/src/symbols/PhutilSymbolLoader.php(370): PhutilBootloader->loadLibrarySource('phutil', 'readableseriali...')
    #1 /opt/libphutil/src/symbols/PhutilSymbolLoader.php(246): PhutilSymbolLoader->loadSymbol(Array)
    ...
    • Oct 29 2013, 10:13 PM
    • 22 Lines
  • [27-Oct-2013 09:09:04 Australia/Melbourne] [2013-10-27 09:09:04] EXCEPTION: (PhutilProxyException) Error while fetching changes to the 'TEST' repository. {>} (Exception) Working copy at '/home/james/git/created' has a mismatched origin URL. It has origin URL 'origin' (with remote path 'origin'), but the configured URL 'file:///home/james/git/created' (with remote path '/home/james/git/created') is expected. Refusing to proceed because this may indicate that the working copy is actually some other repository. at [/home/james/Projects/Phabricator/phabricator/src/applications/repository/daemon/PhabricatorRepositoryPullLocalDaemon.php:629]
    [27-Oct-2013 09:09:04 Australia/Melbourne] #0 PhabricatorRepositoryPullLocalDaemon::executeGitVerifySameOrigin(origin, file:///home/james/git/created, /home/james/git/created) called at [/home/james/Projects/Phabricator/phabricator/src/applications/repository/daemon/PhabricatorRepositoryPullLocalDaemon.php:482]
    [27-Oct-2013 09:09:04 Australia/Melbourne] #1 PhabricatorRepositoryPullLocalDaemon::executeGitDiscover(Object PhabricatorRepository) called at [/home/james/Projects/Phabricator/phabricator/src/applications/repository/daemon/PhabricatorRepositoryPullLocalDaemon.php:206]
    [27-Oct-2013 09:09:04 Australia/Melbourne] #2 PhabricatorRepositoryPullLocalDaemon::discoverRepository(Object PhabricatorRepository) called at [/home/james/Projects/Phabricator/phabricator/src/applications/repository/daemon/PhabricatorRepositoryPullLocalDaemon.php:139]
    [27-Oct-2013 09:09:04 Australia/Melbourne] #3 PhabricatorRepositoryPullLocalDaemon::run() called at [/home/james/Projects/Phabricator/libphutil/src/daemon/PhutilDaemon.php:81]
    ...
    • Oct 26 2013, 10:09 PM
    • 6 Lines
  • 2013/10/27 09:05:26 [error] 1221#0: *51 FastCGI sent in stderr: "PHP message: [2013-10-27 09:05:26] EXCEPTION: (ConduitException) ERR-INVALID-COMMIT at [/home/james/Projects/Phabricator/phabricator/src/applications/diffusion/conduit/ConduitAPI_diffusion_expandshortcommitquery_Method.php:56]
    PHP message: #0 ConduitAPI_diffusion_expandshortcommitquery_Method::getGitOrMercurialResult(Object ConduitAPIRequest) called at [/home/james/Projects/Phabricator/phabricator/src/applications/diffusion/conduit/ConduitAPI_diffusion_expandshortcommitquery_Method.php:40]
    PHP message: #1 ConduitAPI_diffusion_expandshortcommitquery_Method::getGitResult(Object ConduitAPIRequest) called at [/home/james/Projects/Phabricator/phabricator/src/applications/diffusion/conduit/ConduitAPI_diffusion_abstractquery_Method.php:165]
    PHP message: #2 ConduitAPI_diffusion_abstractquery_Method::getResult(Object ConduitAPIRequest) called at [/home/james/Projects/Phabricator/phabricator/src/applications/diffusion/conduit/ConduitAPI_diffusion_abstractquery_Method.php:157]
    PHP message: #3 ConduitAPI_diffusion_abstractquery_Method::execute(Object ConduitAPIRequest) called at [/home/james/Projects/Phabricator/phabricator/src/applications/conduit/method/ConduitAPIMethod.php:68]
    ...
    • Oct 26 2013, 10:05 PM
    • 10 Lines
  • P961 failed
    chad@phab1:/var/www/phabricator$ phabup
    + ROOT=/var/www
    + [ -e /var/www/diviner ]
    + cd /var/www/libphutil
    + git pull
    ...
    • Oct 25 2013, 10:46 PM
    • 19 Lines
  • [2013-10-25 15:04:04] EXCEPTION: (Exception) Unable to load object by phid 'PHID-CMIT-5km4etlpwz2yhdq3l7ty'! at [/opt/phabricator/phabricator/src/applications/search/index/PhabricatorSearchDocumentIndexer.php:31]
    #0 PhabricatorSearchDocumentIndexer::loadDocumentByPHID(PHID-CMIT-5km4etlpwz2yhdq3l7ty) called at [/opt/phabricator/phabricator/src/applications/repository/search/PhabricatorRepositoryCommitSearchIndexer.php:11]
    #1 PhabricatorRepositoryCommitSearchIndexer::buildAbstractDocumentByPHID(PHID-CMIT-5km4etlpwz2yhdq3l7ty) called at [/opt/phabricator/phabricator/src/applications/search/index/PhabricatorSearchDocumentIndexer.php:38]
    #2 PhabricatorSearchDocumentIndexer::indexDocumentByPHID(PHID-CMIT-5km4etlpwz2yhdq3l7ty) called at [/opt/phabricator/phabricator/src/applications/search/index/PhabricatorSearchIndexer.php:22]
    #3 PhabricatorSearchIndexer::indexDocumentByPHID(PHID-CMIT-5km4etlpwz2yhdq3l7ty) called at [/opt/phabricator/phabricator/src/applications/search/management/PhabricatorSearchManagementIndexWorkflow.php:86]
    ...
    • Oct 25 2013, 10:04 PM
    • 9 Lines
  • function showAlert() {
    var app = UiApp.createApplication();
    app.setTitle("Upload File");
    var form = app.createFormPanel();
    ...
    • Oct 22 2013, 3:20 AM
    • 30 Lines
  • resource(265) of type (process)
    array(8) {
    'command' =>
    string(2) "ls"
    'pid' =>
    ...
    • Oct 21 2013, 6:49 PM
    • 21 Lines
  • <?php
    $spec = array(
    0 => array('pipe', 'r'),
    1 => array('pipe', 'w'),
    ...
    • Oct 21 2013, 6:48 PM
    • 14 Lines
  • <!doctype html>
    <html>
    <head>
    <script type="text/javascript">
    setInterval(function() {
    ...
    • Oct 10 2013, 5:16 PM
    • 18 Lines
  • <!doctype
    <html>
    <head>
    <script type="text/javascript">
    setInterval(function() {
    ...
    • Oct 10 2013, 5:16 PM
    • 18 Lines
  • >>> orbital ~/devtools/phabricator $ ./bin/mail show-outbound --id 9979
    PROPERTIES
    ID: 9979
    Status: sent
    Retry Count: 0
    ...
    • Oct 10 2013, 4:08 PM
    • 38 Lines
  • {
    "phone" : {
    "name" : "Phone",
    "description" : "User's phone number.",
    "default" : "derp derp derp",
    ...
    • Oct 2 2013, 4:15 PM
    • 94 Lines
  • $ rcsdiff file.txt
    ===================================================================
    RCS file: file.txt,v
    retrieving revision 1.2
    diff -r1.2 file.txt
    ...
    • Sep 26 2013, 2:48 PM
    • 9 Lines
  • diff --git a/src/applications/maniphest/controller/ManiphestTaskEditController.php b/src/applications/maniphest/controller/ManiphestTaskEditController.php
    index bf10fcf..2f6e942 100644
    --- a/src/applications/maniphest/controller/ManiphestTaskEditController.php
    +++ b/src/applications/maniphest/controller/ManiphestTaskEditController.php
    @@ -81,6 +81,19 @@ final class ManiphestTaskEditController extends ManiphestController {
    ...
    • Sep 18 2013, 6:09 PM
    • 69 Lines
  • <?php
    final class ExampleCustomCategoryField extends ManiphestCustomField {
    private $value;
    ...
    • Sep 16 2013, 10:25 PM
    • 180 Lines
  • $ git status
    # On branch master
    nothing to commit, working directory clean
    $ ls
    README
    ...
    • Jun 24 2013, 3:16 AM
    • 47 Lines
  • var o = require.__debug.modules;
    for (var k in o) { if (k.match(/^__(call|requireModule)__/)) { console.log(k); console.log(JSON.stringify(o[k])); } }
    __call__118
    {"id":"__call__118","refcount":1,"dependencies":["ChatSidebar","m_0_34","m_0_35","m_0_36","LitestandSidebar","LitestandSidebarConfig"],"context":{"_moduleMap":{"m_0_1g":true,"m_0_1n":true,"m_0_1s":true,"m_0_1w":true,"m_0_22":true,"m_0_25":true,"m_0_27":true,"m_0_29":true,"m_0_1x":true,"m_0_1z":true,"m_0_1u":true,"m_0_23":true,"m_ps_0_0_7":true,"m_ps_0_0_8":true,"m_ps_0_0_9":true,"m_ps_0_0_e":true,"m_ps_0_0_j":true,"m_ps_0_0_g":true,"m_ps_0_0_l":true,"m_ps_0_0_i":true,"m_ps_0_0_n":true,"m_ps_0_0_t":true,"m_ps_0_0_v":true,"m_ps_0_0_x":true,"m_ps_0_0_10":true,"m_ps_0_0_12":true,"m_ps_0_0_14":true,"m_ps_0_0_a":true,"m_ps_0_0_b":true,"m_ps_0_0_c":true,"m_ps_0_0_y":true,"m_ps_0_0_1h":true,"m_ps_0_0_2":true,"m_ps_0_0_4":true,"m_ps_0_0_6":true,"m_ps_0_0_15":true,"m_ps_0_0_16":true,"m_ps_0_0_17":true,"m_ps_0_0_18":true,"m_ps_0_0_19":true,"m_ps_0_0_1a":true,"m_ps_0_0_1b":true,"m_ps_0_0_1c":true,"m_ps_0_0_1d":true,"m_ps_0_0_1e":true,"m_ps_0_0_1f":true,"m_ps_0_0_1g":true,"m_ps_0_0_1i":true,"m_0_30":true,"m_0_3a":true,"m_0_3c":true,"m_0_36":true,"m_0_3p":true,"m_0_3q":true,"m_0_35":true,"m_0_37":true,"m_0_3i":true,"m_0_3t":true,"m_0_3u":true,"m_0_3x":true,"m_0_3y":true,"m_0_3z":true,"m_0_40":true,"m_0_3e":true,"m_0_3l":true,"m_0_3r":true,"m_0_3v":true,"m_0_3w":true,"m_0_41":true,"m_0_42":true,"m_0_44":true,"m_0_46":true,"m_0_4f":true,"m_0_48":true,"m_0_4h":true,"m_0_4p":true,"m_0_49":true,"m_0_4j":true,"m_0_4s":true,"m_0_4u":true,"m_ps_0_1_0":true,"m_ps_0_1_5":true,"m_ps_0_1_1":true,"m_ps_0_0_1v":true,"m_ps_0_0_1w":true,"m_ps_0_0_1x":true,"m_ps_0_0_1y":true,"m_ps_0_0_24":true,"m_ps_0_0_2b":true,"m_ps_0_0_26":true,"m_ps_0_0_2d":true,"m_ps_0_0_28":true,"m_ps_0_0_2f":true,"m_ps_0_0_2a":true,"m_ps_0_0_2h":true,"m_ps_0_0_2o":true,"m_ps_0_0_2q":true,"m_ps_0_0_2s":true,"m_ps_0_0_2u":true,"m_ps_0_0_2w":true,"m_ps_0_0_2y":true,"m_ps_0_0_30":true,"m_ps_0_0_32":true,"m_ps_0_0_1z":true,"m_ps_0_0_20":true,"m_ps_0_0_21":true,"m_ps_0_0_22":true,"m_ps_0_0_1k":true,"m_ps_0_0_1m":true,"m_ps_0_0_1o":true,"m_ps_0_0_1q":true,"m_ps_0_0_33":true,"m_ps_0_0_34":true,"m_ps_0_0_35":true,"m_ps_0_0_36":true,"m_ps_0_0_37":true,"m_ps_0_0_38":true,"m_ps_0_0_39":true,"m_ps_0_0_3a":true,"m_ps_0_0_3b":true,"m_ps_0_0_3c":true,"m_ps_0_0_3d":true,"m_ps_0_0_3e":true,"m_ps_0_0_3f":true,"m_ps_0_0_3g":true,"m_ps_0_0_3h":true,"m_ps_0_0_3i":true,"m_0_4x":true,"m_0_4y":true,"m_0_4v":true,"m_0_50":true,"m_0_51":true,"m_0_52":true,"m_0_53":true,"m_0_54":true,"m_0_55":true,"m_0_5b":true,"m_0_5d":true,"m_0_5k":true,"m_0_5j":true,"m_0_5c":true,"m_0_5h":true,"m_0_5n":true,"m_0_5o":true,"m_0_5r":true,"m_0_5s":true,"m_0_5t":true,"m_0_5u":true,"m_0_5v":true,"m_0_5w":true,"m_0_5x":true,"m_0_5y":true,"m_0_5z":true,"m_0_60":true,"m_0_61":true,"m_0_62":true,"m_0_63":true,"m_0_64":true,"m_0_65":true,"m_0_66":true,"m_0_67":true,"m_0_68":true,"m_0_69":true,"m_0_6a":true,"m_0_6b":true,"m_0_6c":true,"m_0_6d":true,"m_0_6e":true,"m_0_6f":true,"m_0_6g":true,"m_0_6h":true,"m_0_6i":true,"m_0_7t":true,"m_0_6j":true,"m_0_6k":true,"m_0_6l":true,"m_0_6m":true,"m_0_6n":true,"m_0_6o":true,"m_0_6p":true,"m_0_6q":true,"m_0_6r":true,"m_0_6s":true,"m_0_6t":true,"m_0_6u":true,"m_0_6v":true,"m_0_6w":true,"m_0_7u":true,"m_0_5l":true,"m_0_5p":true,"m_0_5q":true,"m_0_6x":true,"m_0_6y":true,"m_0_6z":true,"m_0_70":true,"m_0_71":true,"m_0_72":true,"m_0_73":true,"m_0_74":true,"m_0_75":true,"m_0_76":true,"m_0_77":true,"m_0_78":true,"m_0_79":true,"m_0_7a":true,"m_0_7b":true,"m_0_7c":true,"m_0_7d":true,"m_0_7e":true,"m_0_7f":true,"m_0_7g":true,"m_0_7h":true,"m_0_7i":true,"m_0_7j":true,"m_0_7k":true,"m_0_7l":true,"m_0_7m":true,"m_0_7n":true,"m_0_7q":true,"m_0_7v":true,"m_0_7w":true,"m_0_7x":true,"m_0_7y":true,"m_0_7z":true,"m_0_80":true,"m_0_81":true,"m_0_82":true,"m_0_85":true,"m_0_86":true,"m_0_87":true,"m_0_88":true,"m_0_89":true},"_relativeTo":null,"_moduleIDsToCleanup":{"__call__118":["ChatSidebar","init"],"__requireModule__120":["m_0_37",null],"__call__121":["LitestandTickerDisplayController","init"],"__requireModule__125":["m_0_36",null],"__call__126":["Typeahead","init"],"__call__127":["ClearableTypeahead","resetOnCloseButtonClick"],"__call__130":["LitestandTickerDisplayController","registerToggleItem"],"__requireModule__131":["m_0_3p",null],"__requireModule__134":["m_0_35",null],"__call__140":["LitestandSidebarBookmarks","registerFlyoutItem"],"__call__142":["LitestandSidebarBookmarks","init"],"__requireModule__208":["m_0_5b",null],"__requireModule__209":["m_0_5d",null],"__call__210":["Typeahead","init"],"__call__211":["ClearableTypeahead","resetOnCloseButtonClick"],"__requireModule__212":["m_0_5j",null],"__requireModule__215":["m_0_5c",null]}},"special":1,"waitingMap":{},"waiting":0,"hasError":true,"exports":{}}
    __requireModule__120
    ...
    • Jun 21 2013, 10:05 PM
    • 54 Lines
  • We won't do anything bad with your secret stuff.
    • Jun 20 2013, 8:32 PM
    • 1 Line
  • <?php
    foreach (new LiskMigrationIterator(new PhabricatorRepository()) as $repo) {
    echo $repo->getID();
    echo " ";
    ...
    • Jun 17 2013, 12:13 PM
    • 10 Lines
  • APPROXIMATE TABLE SIZES
    test 0.0 MB 0.0%
    phabricator_xhpast 0.0 MB 0.0%
    information_schema 0.0 MB 0.0%
    TABLE_CONSTRAINTS 0.0 MB 0.0%
    ...
    • May 31 2013, 9:21 PM
    • 292 Lines
  • #!/usr/bin/env php
    <?php
    if ($argc > 1) {
    $args = array_slice($argv, 1);
    ...
    • May 24 2013, 12:06 PM
    • 42 Lines
  • <?php
    $a = new TempFile();
    $b = new TempFile();
    ...
    • May 23 2013, 9:48 PM
    • 9 Lines
  • <?php
    var_dump(exec_manual('which diff'));
    var_dump(exec_manual('diff --version'));
    • May 22 2013, 11:27 PM
    • 4 Lines
  • <?php
    $engine = new PhabricatorDifferenceEngine();
    $l = "x\n";
    ...
    • May 22 2013, 11:21 PM
    • 8 Lines
  • <?php
    $min = PHP_INT_MAX;
    $tasks = new LiskMigrationIterator(new PhabricatorWorkerActiveTask());
    ...
    • May 22 2013, 3:39 PM
    • 29 Lines
  • <?php
    final class ExampleReviewerListener extends PhutilEventListener {
    public function register() {
    ...
    • May 16 2013, 7:01 PM
    • 33 Lines
  • require_once __DIR__.'/../vendor/autoload.php';
    // libphutil provides static functions that can't be autoloaded by Composer
    require_once __DIR__.'/../vendor/facebook/libphutil/src/__phutil_library_init__.php';
    ...
    • May 12 2013, 8:41 PM
    • 7 Lines
    • PHP
  • <?php
    class OrbitalQuackField extends DifferentialFieldSpecification {
    private $value;
    ...
    • May 9 2013, 3:41 PM
    • 58 Lines
  • <?php
    class OrbitalDifferentialFieldSelector extends DifferentialFieldSelector {
    public function getFieldSpecifications() {
    ...
    • May 9 2013, 3:41 PM
    • 17 Lines
  • $this->raiseLintAtLine(
    $line_idx + 1,
    1,
    self::LINT_LINE_WRAP,
    'This line is '.number_format(strlen($line)).' characters long, '.
    ...
    • Apr 29 2013, 8:33 PM
    • 16 Lines
  • <VirtualHost *:80>
    ServerAdmin derp@example.com
    DocumentRoot /var/devtools/phabricator/webroot
    ServerAlias ec2-184-72-20-36.us-west-1.compute.amazonaws.com
    ServerName ec2-184-72-20-36.us-west-1.compute.amazonaws.com
    ...
    • Apr 26 2013, 2:33 AM
    • 19 Lines
  • <VirtualHost *:80>
    ServerAdmin derp@example.com
    DocumentRoot /var/devtools/phabricator/webroot
    ServerAlias ec2-184-72-20-36.us-west-1.compute.amazonaws.com
    ServerName ec2-184-72-20-36.us-west-1.compute.amazonaws.com
    ...
    • Apr 26 2013, 2:33 AM
    • 21 Lines
  • $ arc lint --engine ComprehensiveLintEngine --cache 0 -- test.js
    >>> Lint for test.js:
    Error (JSHint1) JSHint Error
    ...
    • Apr 12 2013, 7:23 PM
    • 25 Lines
  • $ arc lint --engine ComprehensiveLintEngine -- test.js
    >>> Lint for test.js:
    Error (JSHint1) JSHint Error
    ...
    • Apr 12 2013, 7:16 PM
    • 16 Lines
  • $ arc lint --engine ComprehensiveLintEngine -- test.js
    >>> Lint for test.js:
    Error (JSHint1) JSHint Error
    ...
    • Apr 12 2013, 7:11 PM
    • 14 Lines
  • diff --git a/src/applications/repository/storage/PhabricatorRepository.php b/src/applications/repository/storage/PhabricatorRepository.php
    index ebc97a3..6132b08 100644
    --- a/src/applications/repository/storage/PhabricatorRepository.php
    +++ b/src/applications/repository/storage/PhabricatorRepository.php
    @@ -159,7 +159,7 @@ final class PhabricatorRepository extends PhabricatorRepositoryDAO
    ...
    • Apr 12 2013, 1:36 PM
    • 31 Lines
  • #ATTENTION!
    #
    #DO NOT MODIFY THIS FILE BECAUSE IT WAS GENERATED AUTOMATICALLY,
    #SO ALL YOUR CHANGES WILL BE LOST THE NEXT TIME THE FILE IS GENERATED.
    #
    ...
    • Jan 20 2013, 6:42 PM
    • 139 Lines
    • Apache Configuration
  • #ATTENTION!
    #
    #DO NOT MODIFY THIS FILE BECAUSE IT WAS GENERATED AUTOMATICALLY,
    #SO ALL YOUR CHANGES WILL BE LOST THE NEXT TIME THE FILE IS GENERATED.
    #
    ...
    • Jan 20 2013, 6:35 PM
    • 48 Lines
    • Apache Configuration
  • <?php
    require_once 'libphutil/src/__phutil_library_init__.php';
    print_r(Filesystem::readRandomCharacters(32) . "\n");
    • Jan 20 2013, 7:02 AM
    • 3 Lines
  • [Rendering Exception] Multiple exceptions during processing and rendering.
    - InvalidArgumentException: Argument 1 passed to idx() must be an array, null given, called in /var/www/phabricator/phabricator/src/applications/files/storage/PhabricatorFile.php on line 483 and defined
    - InvalidArgumentException: Argument 1 passed to idx() must be an array, null given, called in /var/www/phabricator/phabricator/src/applications/files/storage/PhabricatorFile.php on line 483 and defined
    • Jan 18 2013, 1:29 PM
    • 3 Lines
  • commit 51b78be2358d8318f0e94b1c79bbee0dd6d6cf7b
    Author: epriestley <git@epriestley.com>
    Date: Sun Jan 13 19:04:30 2013 -0800
    Issue warnings when comparing strings or unlike types.
    ...
    • Jan 14 2013, 3:16 AM
    • 163 Lines
  • commit e036197dabf3d6b4b8fe7106bdf24cef29b2ffed
    Author: epriestley <git@epriestley.com>
    Date: Sun Jan 13 19:04:30 2013 -0800
    Issue warnings when comparing strings or unlike types.
    ...
    • Jan 14 2013, 3:01 AM
    • 155 Lines
  • commit b13bd2db29ec40532887fdaf037668e84976831d
    Author: epriestley <git@epriestley.com>
    Date: Wed Dec 19 16:39:17 2012 -0800
    Fix EncodeQ implementation in PHPMailer
    ...
    • Dec 20 2012, 12:37 AM
    • 74 Lines
  • diff --git a/src/workflow/ArcanistBaseWorkflow.php b/src/workflow/ArcanistBaseWorkflow.php
    index f53936c..4a40979 100644
    --- a/src/workflow/ArcanistBaseWorkflow.php
    +++ b/src/workflow/ArcanistBaseWorkflow.php
    @@ -1408,11 +1408,20 @@ abstract class ArcanistBaseWorkflow {
    ...
    • Nov 30 2012, 3:57 PM
    • 30 Lines
  • >>> UNRECOVERABLE FATAL ERROR <<<
    Call to undefined method PonderQuestionQuery::setViewer()
    /core/phabricator/src/applications/phid/handle/PhabricatorObjectHandleData.php:91
    ...
    • Nov 23 2012, 10:16 PM
    • 8 Lines
  • $nav = $this->buildBaseSideNav();
    $nav->selectFilter(null);
    $nav->appendChild(
    array(
    $error_view,
    ...
    • Nov 5 2012, 11:45 AM
    • 15 Lines
  • <?
    /**
    * Правила создание правил трактуется самим классом валидации
    * но есть некоторые правила как и для класса CValidator так и для классов
    *Валидаторов это справедливо для методов rules() и rule().
    ...
    • Oct 29 2012, 8:36 AM
    • 261 Lines
    • PHP
  • var https = require('https');
    var querystring = require('querystring');
    var crypto = require('crypto');
    var CONDUIT_HOST = "secure.phabricator.com";
    ...
    • Oct 16 2012, 1:44 AM
    • 64 Lines
  • P554 errors
    [09-Oct-2012 02:20:38] WARNING: [pool www] child 5892 said into stderr: "NOTICE: PHP message: [2012-10-09 02:20:38] ERROR 2048: Only variables should be passed by reference at [/core/phabricator/src/applications/ponder/query/PonderAnswerQuery.php:108]"
    [09-Oct-2012 02:20:38] WARNING: [pool www] child 5892 said into stderr: "NOTICE: PHP message: #0 PonderAnswerQuery::loadSingleByPHID(Object PhabricatorUser, PHID-ANSW-kgopuy2fggffpiddsmuy) called at [/core/phabricator/src/applications/ponder/controller/PonderVoteSaveController.php:43]"
    [09-Oct-2012 02:20:38] WARNING: [pool www] child 5892 said into stderr: "NOTICE: PHP message: #1 PonderVoteSaveController::processRequest() called at [/core/phabricator/webroot/index.php:184]"
    [09-Oct-2012 02:20:40] WARNING: [pool www] child 5858 said into stderr: "NOTICE: PHP message: [2012-10-09 02:20:40] ERROR 2048: Only variables should be passed by reference at [/core/phabricator/src/applications/ponder/query/PonderQuestionQuery.php:66]"
    [09-Oct-2012 02:20:40] WARNING: [pool www] child 5858 said into stderr: "NOTICE: PHP message: #0 PonderQuestionQuery::loadSingleByPHID(Object PhabricatorUser, PHID-QUES-izmpgvcxa2fxrspurxyf) called at [/core/phabricator/src/applications/ponder/controller/PonderVoteSaveController.php:40]"
    ...
    • Oct 9 2012, 2:45 AM
    • 22 Lines
  • $ git clone https://github.com/facebook/phabricator.git
    Cloning into phabricator...
    remote: Counting objects: 48020, done.
    remote: Compressing objects: 100% (17596/17596), done.
    remote: Total 48020 (delta 30397), reused 47024 (delta 29519)
    ...
    • Oct 6 2012, 10:08 PM
    • 20 Lines
  • this is some public text
    • Oct 1 2012, 5:01 AM
    • 1 Line